Could not find artifact com.atlassian.jira:jira-reference-plugin:jar:sources:7.0.11

When i compile the JIRA source I am getting the following error message.

[INFO] Atlassian JIRA - Plugins - DevMode - Func Test Plugin SUCCESS [ 2.217 s]
[INFO] Atlassian JIRA - Plugins - Development Only - Reference Plugin SUCCESS [ 3.863 s]
[INFO] Atlassian JIRA - Plugins - Reference Dependent Plugin SUCCESS [ 2.333 s]
[INFO] Atlassian JIRA - Plugins - Development Only - Reference Upgraded Plugin FAILURE [ 5.275 s]
[INFO] Atlassian JIRA - Plugins - Development Only - Reference Language Pack SKIPPED
[INFO] Atlassian JIRA - Plugins - Development Only - Reference Language Pack SKIPPED
[INFO] Atlassian JIRA - Testing - UI Test Utils … SKIPPED
[INFO] Atlassian JIRA - Testing - WebDriver Tests … SKIPPED
[INFO] ------------------------------------------------------------------------
[INFO] BUILD FAILURE
[INFO] ------------------------------------------------------------------------
[INFO] Total time: 02:42 min
[INFO] Finished at: 2017-03-20T10:43:52-07:00
[INFO] Final Memory: 181M/420M
[INFO] ------------------------------------------------------------------------
[ERROR] Failed to execute goal on project jira-reference-upgraded-plugin: Could not resolve dependencies for project com.atlassian.jira:jira-reference-upgraded-plugin:bundle:7.0.11
: Could not find artifact com.atlassian.jira:jira-reference-plugin:jar:sources:7.0.11 in atlassian-proxy (https://m2proxy.atlassian.com/repository/public) -> [Help 1]

Can you please let me know when this artifact com.atlassian.jira:jira-reference-plugin:jar:sources:7.0.11 would be available for download?

Hi @spatruni,

Are you still getting this error?

Thanks!

Cheers,
Anne Calantog